Target
Aldo-keto reductase family 1 member B1 [K65Q]
Ligand
BDBM50003616
Substrate
Meas. Tech.
ChEMBL_1477653 (CHEMBL3428032)
IC50
57400±n/a nM
Citation
 Iqbal, ZHameed, SAli, STehseen, YShahid, MIqbal, J Synthesis, characterization, hypoglycemic and aldose reductase inhibition activity of arylsulfonylspiro[fluorene-9,5'-imidazolidine]-2',4'-diones. Eur J Med Chem 98:127-38 (2015)  
Target
Name:
Aldo-keto reductase family 1 member B1 [K65Q]
Synonyms:
AKR1B1 Aldose reductase
Type:
Protein
Mol. Mass.:
35916.27
Organism:
Bos taurus (Cattle)
Description:
P16116[K65Q]
Residue:
315
  
Inhibitor
Name:
BDBM50003616
Synonyms:
2-n-propyl-n-valeric acid DPA VALPROIC ACID dipropylacetic acid | n-DPA
Type:
Small organic molecule
Emp. Form.:
C8H16O2
Mol. Mass.:
144.2114
SMILES:
CCCC(CCC)C(O)=O
: