Target
Dual specificity mitogen-activated protein kinase kinase 5
Ligand
BDBM50086266
Substrate
Meas. Tech.
ChEMBL_1478121 (CHEMBL3430298)
Kd
150±n/a nM
Citation
 Kovackova, SChang, LBekerman, ENeveu, GBarouch-Bentov, RChaikuad, AHeroven, C?ála, MDe Jonghe, SKnapp, SEinav, SHerdewijn, P Selective Inhibitors of Cyclin G Associated Kinase (GAK) as Anti-Hepatitis C Agents. J Med Chem 58:3393-410 (2015)  
Target
Name:
Dual specificity mitogen-activated protein kinase kinase 5
Synonyms:
MAP kinase kinase 5 MAPK/ERK kinase 5 MEK5 MP2K5_HUMAN | PRKMK5
Type:
PROTEIN
Mol. Mass.:
50110.16
Organism:
Homo sapiens (Human)
Description:
ChEMBL_1495740
Residue:
448
  
Inhibitor
Name:
BDBM50086266
Synonyms:
CHEMBL3425865
Type:
Small organic molecule
Emp. Form.:
C19H21N3O4S
Mol. Mass.:
387.453
SMILES:
COc1cc(cc(OC)c1OC)-c1cnc2c(snc2c1)N1CCOCC1
: