Target
Glucagon-like peptide 1 receptor
Ligand
BDBM50086599
Substrate
Meas. Tech.
ChEMBL_1477109 (CHEMBL3428276)
Ki
41±n/a nM
Citation
 Hoang, HNSong, KHill, TADerksen, DREdmonds, DJKok, WMLimberakis, CLiras, SLoria, PMMascitti, VMathiowetz, AMMitchell, JMPiotrowski, DWPrice, DAStanton, RVSuen, JYWithka, JMGriffith, DAFairlie, DP Short Hydrophobic Peptides with Cyclic Constraints Are Potent Glucagon-like Peptide-1 Receptor (GLP-1R) Agonists. J Med Chem 58:4080-5 (2015)  
Target
Name:
Glucagon-like peptide 1 receptor
Synonyms:
GLP-1 receptor GLP-1R GLP1R_HUMAN Glucagon-like peptide 1 receptor (GLP-1)
Type:
Enzyme
Mol. Mass.:
53035.78
Organism:
Homo sapiens (Human)
Description:
P43220
Residue:
463
  
Inhibitor
Name:
BDBM50086599
Synonyms:
CHEMBL3426297
Type:
Small organic molecule
Emp. Form.:
C71H91FN14O18S2
Mol. Mass.:
1511.694
SMILES:
CCc1cc(OC)ccc1-c1ccc(C[C@H](NC(=O)[C@H](CC(O)=O)NC(=O)[C@H](CO)NC(=O)[C@@H](NC(=O)[C@](C)(Cc2ccccc2F)NC(=O)[C@H]2CCSSCC[C@@H](NC(=O)[C@@H](N)Cc3cnc[nH]3)C(=O)N[C@@H](CCC(O)=O)C(=O)NCC(=O)N2)[C@@H](C)O)C(=O)N[C@@H](CCCc2ccccc2)C(N)=O)cc1
: