Target
Tyrosine-protein kinase ITK/TSK
Ligand
BDBM50086671
Substrate
Meas. Tech.
ChEMBL_1477114 (CHEMBL3428281)
IC50
33.0±n/a nM
Citation
 Burch, JDBarrett, KChen, YDeVoss, JEigenbrot, CGoldsmith, RIsmaili, MHLau, KLin, ZOrtwine, DFZarrin, AAMcEwan, PABarker, JJEllebrandt, CKordt, DStein, DBWang, XChen, YHu, BXu, XYuen, PWZhang, YPei, Z Tetrahydroindazoles as Interleukin-2 Inducible T-Cell Kinase Inhibitors. Part II. Second-Generation Analogues with Enhanced Potency, Selectivity, and Pharmacodynamic Modulation in Vivo. J Med Chem 58:3806-16 (2015)  
Target
Name:
Tyrosine-protein kinase ITK/TSK
Synonyms:
EMT ITK_HUMAN LYK Tyrosine-protein kinase ITK Tyrosine-protein kinase Lyk
Type:
Protein
Mol. Mass.:
71839.20
Organism:
Homo sapiens (Human)
Description:
Q08881
Residue:
620
  
Inhibitor
Name:
BDBM50086671
Synonyms:
CHEMBL3426305
Type:
Small organic molecule
Emp. Form.:
C25H31N5O2S
Mol. Mass.:
465.611
SMILES:
CC1(C)CCc2c(C1)[nH]nc2C(=O)Nc1cnn(c1)[C@@H](C1CC[S+]([O-])CC1)c1ccccc1
: