Target
Tyrosine-protein kinase Lck
Ligand
BDBM50086659
Substrate
Meas. Tech.
ChEMBL_1477116 (CHEMBL3428283)
Ki
>2500±n/a nM
Citation
 Burch, JDBarrett, KChen, YDeVoss, JEigenbrot, CGoldsmith, RIsmaili, MHLau, KLin, ZOrtwine, DFZarrin, AAMcEwan, PABarker, JJEllebrandt, CKordt, DStein, DBWang, XChen, YHu, BXu, XYuen, PWZhang, YPei, Z Tetrahydroindazoles as Interleukin-2 Inducible T-Cell Kinase Inhibitors. Part II. Second-Generation Analogues with Enhanced Potency, Selectivity, and Pharmacodynamic Modulation in Vivo. J Med Chem 58:3806-16 (2015)  
Target
Name:
Tyrosine-protein kinase Lck
Synonyms:
2.7.10.2 LCK_HUMAN Leukocyte C-terminal Src kinase Lymphocyte-specific protein tyrosine kinase Protein YT16 Proto-oncogene tyrosine-protein kinase LCK T cell-specific protein-tyrosine kinase
Type:
Mol. Mass.:
57987.83
Organism:
Homo sapiens (Human)
Description:
P06239
Residue:
509
  
Inhibitor
Name:
BDBM50086659
Synonyms:
CHEMBL3426303
Type:
Small organic molecule
Emp. Form.:
C25H31N5O3S
Mol. Mass.:
481.61
SMILES:
CC1(C)CCc2c(C1)[nH]nc2C(=O)Nc1cnn(c1)[C@@H](C1CCCCS1(=O)=O)c1ccccc1
: