Target
Tyrosine-protein kinase Lck
Ligand
BDBM50086604
Substrate
Meas. Tech.
ChEMBL_1477116 (CHEMBL3428283)
Ki
260±n/a nM
Citation
 Burch, JDBarrett, KChen, YDeVoss, JEigenbrot, CGoldsmith, RIsmaili, MHLau, KLin, ZOrtwine, DFZarrin, AAMcEwan, PABarker, JJEllebrandt, CKordt, DStein, DBWang, XChen, YHu, BXu, XYuen, PWZhang, YPei, Z Tetrahydroindazoles as Interleukin-2 Inducible T-Cell Kinase Inhibitors. Part II. Second-Generation Analogues with Enhanced Potency, Selectivity, and Pharmacodynamic Modulation in Vivo. J Med Chem 58:3806-16 (2015)  
Target
Name:
Tyrosine-protein kinase Lck
Synonyms:
2.7.10.2 LCK_HUMAN Leukocyte C-terminal Src kinase Lymphocyte-specific protein tyrosine kinase Protein YT16 Proto-oncogene tyrosine-protein kinase LCK T cell-specific protein-tyrosine kinase
Type:
Mol. Mass.:
57987.83
Organism:
Homo sapiens (Human)
Description:
P06239
Residue:
509
  
Inhibitor
Name:
BDBM50086604
Synonyms:
CHEMBL3426308
Type:
Small organic molecule
Emp. Form.:
C25H29N5O3S
Mol. Mass.:
479.594
SMILES:
[H][C@@]12C[C@]1(C)Cc1[nH]nc(C(=O)Nc3cnn(c3)[C@@H](C3CCS(=O)(=O)CC3)c3ccccc3)c1C2
: