Target
ATP-dependent translocase ABCB1
Ligand
BDBM50086882
Substrate
Meas. Tech.
ChEMBL_1477586 (CHEMBL3430271)
IC50
32800±n/a nM
Citation
 Köhler, SCWiese, M HM30181 Derivatives as Novel Potent and Selective Inhibitors of the Breast Cancer Resistance Protein (BCRP/ABCG2). J Med Chem 58:3910-21 (2015)  
Target
Name:
ATP-dependent translocase ABCB1
Synonyms:
ABCB1 MDR1_HUMAN Multidrug resistance protein 1 P-glycoprotein (P-gp) PGY1
Type:
Protein
Mol. Mass.:
141503.50
Organism:
Homo sapiens (Human)
Description:
P08183
Residue:
1280
  
Inhibitor
Name:
BDBM50086882
Synonyms:
CHEMBL3426397
Type:
Small organic molecule
Emp. Form.:
C24H23N5O4
Mol. Mass.:
445.4705
SMILES:
CCOc1ccc(cc1)-n1nnc(n1)-c1ccccc1NC(=O)c1ccc(OC)c(OC)c1
: