Target
Carbonic anhydrase 2
Ligand
BDBM50087046
Substrate
Meas. Tech.
ChEMBL_1477827 (CHEMBL3428962)
Ki
>10000±n/a nM
Citation
 Grandane, ATanc, MDi Cesare Mannelli, LCarta, FGhelardini, C?alubovskis, RSupuran, CT 6-Substituted sulfocoumarins are selective carbonic anhdydrase IX and XII inhibitors with significant cytotoxicity against colorectal cancer cells. J Med Chem 58:3975-83 (2015)  
Target
Name:
Carbonic anhydrase 2
Synonyms:
CA-II CAC Carbonate dehydratase II Carbonic anhydrase 2 (CA-II) Carbonic anhydrase C Carbonic anhydrase II (CA-II) Carbonic anhydrase II (hCA II) | Carbonic anhydrase isoenzyme II (hCA II)
Type:
Enzyme
Mol. Mass.:
29250.71
Organism:
Homo sapiens (Human)
Description:
P00918
Residue:
260
  
Inhibitor
Name:
BDBM50087046
Synonyms:
CHEMBL3426538
Type:
Small organic molecule
Emp. Form.:
C13H9NO5S
Mol. Mass.:
291.279
SMILES:
O=C(Nc1ccc2OS(=O)(=O)C=Cc2c1)c1ccco1
: