Target
Carbonic anhydrase 9
Ligand
BDBM50087054
Substrate
Meas. Tech.
ChEMBL_1477828 (CHEMBL3428963)
Ki
17±n/a nM
Citation
 Grandane, ATanc, MDi Cesare Mannelli, LCarta, FGhelardini, C?alubovskis, RSupuran, CT 6-Substituted sulfocoumarins are selective carbonic anhdydrase IX and XII inhibitors with significant cytotoxicity against colorectal cancer cells. J Med Chem 58:3975-83 (2015)  
Target
Name:
Carbonic anhydrase 9
Synonyms:
CA-IX CAH9_HUMAN Carbonic anhydrase 9 (CA IX) Carbonic anhydrase 9 precursor Carbonic anhydrase IX (CAIX) Carbonic anhydrases; II & IX MN RCC-associated antigen G250
Type:
Enzyme
Mol. Mass.:
49669.03
Organism:
Homo sapiens (Human)
Description:
Catalytic domain of human cloned isozyme was used in the assay
Residue:
459
  
Inhibitor
Name:
BDBM50087054
Synonyms:
CHEMBL3426530
Type:
Small organic molecule
Emp. Form.:
C10H9NO4S
Mol. Mass.:
239.248
SMILES:
CC(=O)Nc1ccc2OS(=O)(=O)C=Cc2c1
: