Target
Low molecular weight phosphotyrosine protein phosphatase
Ligand
BDBM50088047
Substrate
Meas. Tech.
ChEMBL_1476527 (CHEMBL3428078)
IC50
3800±n/a nM
Citation
 Carneiro, VMTrivella, DBScorsato, VBeraldo, VLDias, MPSobreira, TJAparicio, RPilli, RA Is RK-682 a promiscuous enzyme inhibitor? Synthesis and in vitro evaluation of protein tyrosine phosphatase inhibition of racemic RK-682 and analogues. Eur J Med Chem 97:42-54 (2015)  
Target
Name:
Low molecular weight phosphotyrosine protein phosphatase
Synonyms:
3.1.3.2 ACP1 LMW-PTP LMWPTP PPAC_HUMAN low molecular weight phosphotyrosine protein phosphatase isoform c
Type:
Mol. Mass.:
18042.81
Organism:
Homo sapiens (Human)
Description:
P24666
Residue:
158
  
Inhibitor
Name:
BDBM50088047
Synonyms:
CHEMBL3427126
Type:
Small organic molecule
Emp. Form.:
C35H44O7
Mol. Mass.:
576.7197
SMILES:
CCCCCCCCCCCCCCCC(=O)C1=C(O)C(COC(=O)c2ccc(cc2)C(=O)c2ccccc2)OC1=O
: