Target
Sodium channel protein type 7 subunit alpha
Ligand
BDBM18957
Substrate
Meas. Tech.
ChEMBL_1478668 (CHEMBL3430569)
IC50
4800±n/a nM
Citation
 Mirams, GRCui, YSher, AFink, MCooper, JHeath, BMMcMahon, NCGavaghan, DJNoble, D Simulation of multiple ion channel block provides improved early prediction of compounds' clinical torsadogenic risk. Cardiovasc Res 91:53-61 (2011)  
Target
Name:
Sodium channel protein type 7 subunit alpha
Synonyms:
Putative voltage-gated sodium channel subunit alpha Nax SCN7A Sodium channel protein cardiac and skeletal muscle subunit alpha Sodium channel protein type VII subunit alpha
Type:
PROTEIN
Mol. Mass.:
193514.99
Organism:
Homo sapiens (Human)
Description:
ChEMBL_105639
Residue:
1682
  
Inhibitor
Name:
BDBM18957
Synonyms:
(2-{4-[(2-butyl-1-benzofuran-3-yl)carbonyl]-2,6-diiodophenoxy}ethyl)diethylamine Amiodarone Cordarone cid_441325
Type:
Small organic molecule
Emp. Form.:
C25H29I2NO3
Mol. Mass.:
645.3116
SMILES:
CCCCc1oc2ccccc2c1C(=O)c1cc(I)c(OCCN(CC)CC)c(I)c1
: