Target
Sodium channel protein type 5 subunit alpha
Ligand
BDBM50067133
Substrate
Meas. Tech.
ChEMBL_1478688 (CHEMBL3430589)
IC50
1190±n/a nM
Citation
 Mirams, GRCui, YSher, AFink, MCooper, JHeath, BMMcMahon, NCGavaghan, DJNoble, D Simulation of multiple ion channel block provides improved early prediction of compounds' clinical torsadogenic risk. Cardiovasc Res 91:53-61 (2011)  
Target
Name:
Sodium channel protein type 5 subunit alpha
Synonyms:
HH1 SCN5A_HUMAN Sodium channel protein type 5 subunit alpha/beta-1/beta-2 Voltage-gated sodium channel subunit alpha Nav1.5
Type:
Enzyme
Mol. Mass.:
226908.60
Organism:
Homo sapiens (Human)
Description:
Q14524
Residue:
2016
  
Inhibitor
Name:
BDBM50067133
Synonyms:
1-(2-(2-hydroxy-3-(propylamino)propoxy)phenyl)-3-phenylpropan-1-one 1-[2-(2-Hydroxy-3-propylamino-propoxy)-phenyl]-3-phenyl-propan-1-one (propafenone) CHEMBL631 PROPAFENONE | Rythmol
Type:
Small organic molecule
Emp. Form.:
C21H27NO3
Mol. Mass.:
341.444
SMILES:
CCCNCC(O)COc1ccccc1C(=O)CCc1ccccc1
: