Target
Voltage-dependent L-type calcium channel subunit alpha-1C
Ligand
BDBM35229
Substrate
Meas. Tech.
ChEMBL_1478703 (CHEMBL3430604)
IC50
1709±n/a nM
Citation
 Mirams, GRCui, YSher, AFink, MCooper, JHeath, BMMcMahon, NCGavaghan, DJNoble, D Simulation of multiple ion channel block provides improved early prediction of compounds' clinical torsadogenic risk. Cardiovasc Res 91:53-61 (2011)  
Target
Name:
Voltage-dependent L-type calcium channel subunit alpha-1C
Synonyms:
CAC1C_CAVPO CACH2 CACNA1C CCHL1A1 Voltage-dependent L-type calcium channel subunit alpha-1C | Voltage-gated calcium channel subunit alpha Cav1.2
Type:
PROTEIN
Mol. Mass.:
19518.62
Organism:
Cavia porcellus
Description:
ChEMBL_106600
Residue:
169
  
Inhibitor
Name:
BDBM35229
Synonyms:
3-(10,11-dihydro-5H-dibenzo[b,f]azepin-5-yl)-N-methylpropan-1-amine CHEMBL72 DMI Desipramine N-(3-methylaminopropyl)iminobibenzyl demethylimipramine norimipramine
Type:
Small organic molecule
Emp. Form.:
C18H22N2
Mol. Mass.:
266.3807
SMILES:
CNCCCN1c2ccccc2CCc2ccccc12
: