Target
Sodium channel protein type 5 subunit alpha
Ligand
BDBM8125
Substrate
Meas. Tech.
ChEMBL_1478517 (CHEMBL3430418)
IC50
39811±n/a nM
Citation
 Mirams, GRDavies, MRBrough, SJBridgland-Taylor, MHCui, YGavaghan, DJAbi-Gerges, N Prediction of Thorough QT study results using action potential simulations based on ion channel screens. J Pharmacol Toxicol Methods 70:246-54 (2014)  
Target
Name:
Sodium channel protein type 5 subunit alpha
Synonyms:
HH1 SCN5A_HUMAN Sodium channel protein type 5 subunit alpha/beta-1/beta-2 Voltage-gated sodium channel subunit alpha Nav1.5
Type:
Enzyme
Mol. Mass.:
226908.60
Organism:
Homo sapiens (Human)
Description:
Q14524
Residue:
2016
  
Inhibitor
Name:
BDBM8125
Synonyms:
(3R,3aS,6aR)-hexahydrofuro[2,3-b]furan-3-yl N-[(2S,3R)-4-[(4-aminobenzene)(2-methylpropyl)sulfonamido]-3-hydroxy-1-phenylbutan-2-yl]carbamate Darunavir TMC-114 US10806794, Compound Darunavir
Type:
Small organic molecule
Emp. Form.:
C27H37N3O7S
Mol. Mass.:
547.664
SMILES:
[H][C@@]1(CO[C@@]2([H])OCC[C@@]12[H])OC(=O)N[C@@H](Cc1ccccc1)[C@H](O)CN(CC(C)C)S(=O)(=O)c1ccc(N)cc1
: