Target
Sodium channel protein type 5 subunit alpha
Ligand
BDBM50370682
Substrate
Meas. Tech.
ChEMBL_1478541 (CHEMBL3430442)
IC50
6310±n/a nM
Citation
 Mirams, GRDavies, MRBrough, SJBridgland-Taylor, MHCui, YGavaghan, DJAbi-Gerges, N Prediction of Thorough QT study results using action potential simulations based on ion channel screens. J Pharmacol Toxicol Methods 70:246-54 (2014)  
Target
Name:
Sodium channel protein type 5 subunit alpha
Synonyms:
HH1 SCN5A_HUMAN Sodium channel protein type 5 subunit alpha/beta-1/beta-2 Voltage-gated sodium channel subunit alpha Nav1.5
Type:
Enzyme
Mol. Mass.:
226908.60
Organism:
Homo sapiens (Human)
Description:
Q14524
Residue:
2016
  
Inhibitor
Name:
BDBM50370682
Synonyms:
SOLIFENACIN
Type:
Small organic molecule
Emp. Form.:
C23H26N2O2
Mol. Mass.:
362.4647
SMILES:
[H]C12CCN(CC1)C[C@@H]2OC(=O)N1CCc2ccccc2[C@@H]1c1ccccc1
: