Target
Bile salt export pump
Ligand
BDBM50103521
Substrate
Meas. Tech.
ChEMBL_1481882 (CHEMBL3540573)
IC50
300±n/a nM
Citation
 Dawson, SStahl, SPaul, NBarber, JKenna, JG In vitro inhibition of the bile salt export pump correlates with risk of cholestatic drug-induced liver injury in humans. Drug Metab Dispos 40:130-8 (2011)  
Target
Name:
Bile salt export pump
Synonyms:
ABCB11 ATP-binding cassette sub-family B member 11 Bile Salt Export Pump, BSEP Bile salt export pump (BSEP)
Type:
Protein
Mol. Mass.:
146405.49
Organism:
Homo sapiens (Human)
Description:
O95342
Residue:
1321
  
Inhibitor
Name:
BDBM50103521
Synonyms:
Actos Duetact US10188639, Compound h-rac-pio | US11141411, Compound h-rac-pio
Type:
Small organic molecule
Emp. Form.:
C19H20N2O3S
Mol. Mass.:
356.439
SMILES:
CCc1ccc(CCOc2ccc(CC3SC(=O)NC3=O)cc2)nc1
: