Target
Bile salt export pump
Ligand
BDBM50103508
Substrate
Meas. Tech.
ChEMBL_1481882 (CHEMBL3540573)
IC50
22300±n/a nM
Citation
 Dawson, SStahl, SPaul, NBarber, JKenna, JG In vitro inhibition of the bile salt export pump correlates with risk of cholestatic drug-induced liver injury in humans. Drug Metab Dispos 40:130-8 (2011)  
Target
Name:
Bile salt export pump
Synonyms:
ABCB11 ATP-binding cassette sub-family B member 11 Bile Salt Export Pump, BSEP Bile salt export pump (BSEP)
Type:
Protein
Mol. Mass.:
146405.49
Organism:
Homo sapiens (Human)
Description:
O95342
Residue:
1321
  
Inhibitor
Name:
BDBM50103508
Synonyms:
CHEBI:31653 Glaphenine R-1707
Type:
Small organic molecule
Emp. Form.:
C19H17ClN2O4
Mol. Mass.:
372.802
SMILES:
OCC(O)COC(=O)c1ccccc1Nc1ccnc2cc(Cl)ccc12
: