Target
Nuclear receptor subfamily 1 group I member 2
Ligand
BDBM50030448
Substrate
Meas. Tech.
ChEMBL_1487572 (CHEMBL3531878)
EC50
5000±n/a nM
Citation
 Shukla, SJSakamuru, SHuang, RMoeller, TAShinn, PVanleer, DAuld, DSAustin, CPXia, M Identification of clinically used drugs that activate pregnane X receptors. Drug Metab Dispos 39:151-9 (2010)  
Target
Name:
Nuclear receptor subfamily 1 group I member 2
Synonyms:
NR1I2 Orphan nuclear receptor PAR1 PXR SXR nuclear receptor subfamily 1 group I member 2 isoform 1
Type:
Nuclear receptor
Mol. Mass.:
49774.77
Organism:
Homo sapiens (Human)
Description:
O75469
Residue:
434
  
Inhibitor
Name:
BDBM50030448
Synonyms:
8-DEETHYL-8-[BUT-3-ENYL]-ASCOMYCIN TACROLIMUS
Type:
Small organic molecule
Emp. Form.:
C44H69NO12
Mol. Mass.:
804.0182
SMILES:
CO[C@@H]1C[C@@H](CC[C@H]1O)\C=C(/C)[C@H]1OC(=O)[C@@H]2CCCCN2C(=O)C(=O)[C@]2(O)O[C@@H]([C@H](C[C@H]2C)OC)[C@H](C[C@@H](C)C\C(C)=C\[C@@H](CC=C)C(=O)C[C@H](O)[C@H]1C)OC
: