Target
Aldehyde oxidase
Ligand
BDBM86521
Substrate
Meas. Tech.
ChEMBL_1490775 (CHEMBL3532077)
Ki
83000±n/a nM
Citation
 Strelevitz, TJOrozco, CCObach, RS Hydralazine as a selective probe inactivator of aldehyde oxidase in human hepatocytes: estimation of the contribution of aldehyde oxidase to metabolic clearance. Drug Metab Dispos 40:1441-8 (2012)  
Target
Name:
Aldehyde oxidase
Synonyms:
AO AOXA_HUMAN | Aldehyde oxidase
Type:
PROTEIN
Mol. Mass.:
147930.97
Organism:
Homo sapiens (Human)
Description:
ChEMBL_1481150
Residue:
1338
  
Inhibitor
Name:
BDBM86521
Synonyms:
CAS_5719 Zaleplon
Type:
Small organic molecule
Emp. Form.:
C17H15N5O
Mol. Mass.:
305.3339
SMILES:
CCN(C(C)=O)c1cccc(c1)-c1ccnc2c(cnn12)C#N
: