Target
Sodium/nucleoside cotransporter 2
Ligand
BDBM14487
Substrate
Meas. Tech.
ChEMBL_1494516 (CHEMBL3528993)
IC50
5500±n/a nM
Citation
 Lepist, EIDamaraju, VLZhang, JGati, WPYao, SYSmith, KMKarpinski, EYoung, JDLeung, KHCass, CE Transport of A1 adenosine receptor agonist tecadenoson by human and mouse nucleoside transporters: evidence for blood-brain barrier transport by murine equilibrative nucleoside transporter 1 mENT1. Drug Metab Dispos 41:916-22 (2013)  
Target
Name:
Sodium/nucleoside cotransporter 2
Synonyms:
CNT2 SLC28A2
Type:
PROTEIN
Mol. Mass.:
71934.06
Organism:
Homo sapiens (Human)
Description:
ChEMBL_1477251
Residue:
658
  
Inhibitor
Name:
BDBM14487
Synonyms:
(2R,3R,4S,5R)-2-(6-amino-9H-purin-9-yl)-5-(hydroxymethyl)oxolane-3,4-diol Adenosine N6-Methylado cid_191 | cid_60961
Type:
Nucleoside or nucleotide
Emp. Form.:
C10H13N5O4
Mol. Mass.:
267.2413
SMILES:
Nc1ncnc2n(cnc12)[C@@H]1O[C@H](CO)[C@@H](O)[C@H]1O
: