Target
Equilibrative nucleoside transporter 2
Ligand
BDBM14487
Substrate
Meas. Tech.
ChEMBL_1494514 (CHEMBL3528991)
Ki
106000±n/a nM
Citation
 Lepist, EIDamaraju, VLZhang, JGati, WPYao, SYSmith, KMKarpinski, EYoung, JDLeung, KHCass, CE Transport of A1 adenosine receptor agonist tecadenoson by human and mouse nucleoside transporters: evidence for blood-brain barrier transport by murine equilibrative nucleoside transporter 1 mENT1. Drug Metab Dispos 41:916-22 (2013)  
Target
Name:
Equilibrative nucleoside transporter 2
Synonyms:
36 kDa nucleolar protein HNP36 DER12 ENT2 Equilibrative nitrobenzylmercaptopurine riboside-insensitive nucleoside transporter HNP36 Nucleoside transporter, ei-type SLC29A2 | Solute carrier family 29 member 2
Type:
PROTEIN
Mol. Mass.:
50110.91
Organism:
Homo sapiens (Human)
Description:
ChEMBL_109695
Residue:
456
  
Inhibitor
Name:
BDBM14487
Synonyms:
(2R,3R,4S,5R)-2-(6-amino-9H-purin-9-yl)-5-(hydroxymethyl)oxolane-3,4-diol Adenosine N6-Methylado cid_191 | cid_60961
Type:
Nucleoside or nucleotide
Emp. Form.:
C10H13N5O4
Mol. Mass.:
267.2413
SMILES:
Nc1ncnc2n(cnc12)[C@@H]1O[C@H](CO)[C@@H](O)[C@H]1O
: