Target
Neutral amino acid transporter B(0)
Ligand
BDBM50088533
Substrate
Meas. Tech.
ChEMBL_1495669 (CHEMBL3578657)
IC50
776000±n/a nM
Citation
 Schulte, MLDawson, ESSaleh, SACuthbertson, MLManning, HC 2-Substituted N¿-glutamylanilides as novel probes of ASCT2 with improved potency. Bioorg Med Chem Lett 25:113-6 (2014)  
Target
Name:
Neutral amino acid transporter B(0)
Synonyms:
AAAT_HUMAN ASCT2 Baboon M7 virus receptor Neutral amino acid transporter B(0) RDR SLC1A5 Solute carrier family 1 member 5
Type:
PROTEIN
Mol. Mass.:
56592.12
Organism:
Homo sapiens (Human)
Description:
ChEMBL_109758
Residue:
541
  
Inhibitor
Name:
BDBM50088533
Synonyms:
CHEMBL3576936 | US10189805, Compound 12
Type:
Small organic molecule
Emp. Form.:
C16H23N3O3
Mol. Mass.:
305.3721
SMILES:
N[C@@H](CCC(=O)Nc1ccccc1N1CCCCC1)C(O)=O
: