Target
ATP-dependent translocase ABCB1
Ligand
BDBM50088574
Substrate
Meas. Tech.
ChEMBL_1496424 (CHEMBL3580314)
Ki
290±n/a nM
Citation
 Callies, OSánchez-Cañete, MPGamarro, FJiménez, IACastanys, SBazzocchi, IL Restoration of Chemosensitivity in P-Glycoprotein-Dependent Multidrug-Resistant Cells by Dihydro-ß-agarofuran Sesquiterpenes from Celastrus vulcanicola. J Nat Prod 78:736-45 (2015)  
Target
Name:
ATP-dependent translocase ABCB1
Synonyms:
ABCB1 MDR1_HUMAN Multidrug resistance protein 1 P-glycoprotein (P-gp) PGY1
Type:
Protein
Mol. Mass.:
141503.50
Organism:
Homo sapiens (Human)
Description:
P08183
Residue:
1280
  
Inhibitor
Name:
BDBM50088574
Synonyms:
CHEMBL3577218
Type:
Small organic molecule
Emp. Form.:
C35H39NO10
Mol. Mass.:
633.6849
SMILES:
[H][C@]12C[C@H](OC(=O)c3ccccc3)[C@]3(C)[C@@H](OC(C)=O)[C@H](C[C@@H](C)[C@@]3(OC1(C)C)[C@@H]2ON1C(=O)CCC1=O)OC(=O)c1ccccc1
: