Target
Protein arginine N-methyltransferase 7
Ligand
BDBM50009672
Substrate
Meas. Tech.
ChEMBL_1496151 (CHEMBL3578932)
IC50
>50000±n/a nM
Citation
 Smil, DEram, MSLi, FKennedy, SSzewczyk, MMBrown, PJBarsyte-Lovejoy, DArrowsmith, CHVedadi, MSchapira, M Discovery of a Dual PRMT5-PRMT7 Inhibitor. ACS Med Chem Lett 6:408-12 (2015)  
Target
Name:
Protein arginine N-methyltransferase 7
Synonyms:
ANM7_HUMAN KIAA1933 Protein arginine N-methyltransferase 7 [Myelin basic protein]-arginine N-methyltransferase PRMT7
Type:
Enzyme
Mol. Mass.:
78440.77
Organism:
Homo sapiens (Human)
Description:
Q9NVM4
Residue:
692
  
Inhibitor
Name:
BDBM50009672
Synonyms:
AdoHcy S-(5'-adenosyl)-L-homocysteine S-[1-(adenin-9-yl)-1,5-dideoxy-beta-D-ribofuranos-5-yl]-L-homocysteine SAH US9175331, 1 | US9333217, S-Adenosyl-L-homocysteine (SAH)
Type:
Small organic molecule
Emp. Form.:
C14H20N6O5S
Mol. Mass.:
384.411
SMILES:
N[C@@H](CCSC[C@H]1O[C@H]([C@H](O)[C@@H]1O)n1cnc2c(N)ncnc12)C(O)=O
: