Target
Carboxypeptidase B2
Ligand
BDBM50089686
Substrate
Meas. Tech.
ChEMBL_1496377 (CHEMBL3580143)
IC50
1.9±n/a nM
Citation
 Halland, NBrönstrup, MCzech, JCzechtizky, WEvers, AFollmann, MKohlmann, MSchiell, MKurz, MSchreuder, HAKallus, C Novel Small Molecule Inhibitors of Activated Thrombin Activatable Fibrinolysis Inhibitor (TAFIa) from Natural Product Anabaenopeptin. J Med Chem 58:4839-44 (2015)  
Target
Name:
Carboxypeptidase B2
Synonyms:
CBPB2_HUMAN CPU Carboxypeptidase B2 isoform A Plasma carboxypeptidase B Thrombin-activable fibrinolysis inhibitor | pCPB
Type:
Enzyme
Mol. Mass.:
48432.74
Organism:
Homo sapiens (Human)
Description:
Q96IY4
Residue:
423
  
Inhibitor
Name:
BDBM50089686
Synonyms:
CHEMBL3577334
Type:
Small organic molecule
Emp. Form.:
C41H60N8O9
Mol. Mass.:
808.9633
SMILES:
CC(C)[C@@H]1NC(=O)[C@@H](CCCCNC(=O)[C@H](Cc2ccccc2)NC(=O)[C@H](C)N(C)C(=O)[C@H](CCc2ccc(O)cc2)NC1=O)NC(=O)N[C@@H](CCCCN)C(O)=O
: