Target
L-lactate dehydrogenase B chain
Ligand
BDBM50089923
Substrate
Meas. Tech.
ChEMBL_1499430 (CHEMBL3583865)
IC50
120±n/a nM
Citation
 Labadie, SDragovich, PSChen, JFauber, BPBoggs, JCorson, LBDing, CZEigenbrot, CGe, HHo, QLai, KWMa, SMalek, SPeterson, DPurkey, HERobarge, KSalphati, LSideris, SUltsch, MVanderPorten, EWei, BXu, QYen, IYue, QZhang, HZhang, XZhou, A Optimization of 5-(2,6-dichlorophenyl)-3-hydroxy-2-mercaptocyclohex-2-enones as potent inhibitors of human lactate dehydrogenase. Bioorg Med Chem Lett 25:75-82 (2015)  
Target
Name:
L-lactate dehydrogenase B chain
Synonyms:
L-lactate dehydrogenase B LDH heart subunit LDH-H LDHB_HUMAN Renal carcinoma antigen NY-REN-46
Type:
Oxidoreductase; homotetramer
Mol. Mass.:
36635.55
Organism:
Homo sapiens (Human)
Description:
Residue:
334
  
Inhibitor
Name:
BDBM50089923
Synonyms:
CHEMBL3581204
Type:
Small organic molecule
Emp. Form.:
C28H23Cl3O4S
Mol. Mass.:
561.904
SMILES:
CCOC(=O)Cc1ccc(Cl)c(SC2=C(O)CC(CC2=O)c2c(Cl)ccc(c2Cl)-c2ccccc2)c1
: