Target
L-lactate dehydrogenase A chain
Ligand
BDBM50089951
Substrate
Meas. Tech.
ChEMBL_1499429 (CHEMBL3583864)
IC50
100±n/a nM
Citation
 Labadie, SDragovich, PSChen, JFauber, BPBoggs, JCorson, LBDing, CZEigenbrot, CGe, HHo, QLai, KWMa, SMalek, SPeterson, DPurkey, HERobarge, KSalphati, LSideris, SUltsch, MVanderPorten, EWei, BXu, QYen, IYue, QZhang, HZhang, XZhou, A Optimization of 5-(2,6-dichlorophenyl)-3-hydroxy-2-mercaptocyclohex-2-enones as potent inhibitors of human lactate dehydrogenase. Bioorg Med Chem Lett 25:75-82 (2015)  
Target
Name:
L-lactate dehydrogenase A chain
Synonyms:
Cell proliferation-inducing gene 19 protein L-lactate dehydrogenase A Chain LDH-A LDHA Lactate dehydrogenase A (LDHA) | Renal carcinoma antigen NY-REN-59
Type:
Protein
Mol. Mass.:
36694.85
Organism:
Homo sapiens (Human)
Description:
P00338::PDB Code: 4ajp
Residue:
332
  
Inhibitor
Name:
BDBM50089951
Synonyms:
CHEMBL3581177
Type:
Small organic molecule
Emp. Form.:
C24H23Cl3N2O3S
Mol. Mass.:
525.875
SMILES:
CC(=O)N1CCN(CC1)c1ccc(Cl)c(C2CC(O)=C(Sc3ccccc3Cl)C(=O)C2)c1Cl
: