Target
Alpha-1D adrenergic receptor
Ligand
BDBM50091351
Substrate
Meas. Tech.
ChEMBL_1497913 (CHEMBL3583057)
IC50
<5.0±n/a nM
Citation
 Zhang, WMa, ZLi, WLi, GChen, LLiu, ZDu, LLi, M Discovery of Quinazoline-Based Fluorescent Probes toa1-Adrenergic Receptors. ACS Med Chem Lett 6:502-6 (2015)  
Target
Name:
Alpha-1D adrenergic receptor
Synonyms:
ADA1D_HUMAN ADRA1D Adrenergic receptor alpha Alpha 1D-adrenoreceptor Alpha-1D adrenoceptor adrenergic Alpha1D
Type:
Enzyme Catalytic Domain
Mol. Mass.:
60485.82
Organism:
Homo sapiens (Human)
Description:
adrenergic Alpha1D ADRA1D HUMAN::P25100
Residue:
572
  
Inhibitor
Name:
BDBM50091351
Synonyms:
CHEMBL3582269
Type:
Small organic molecule
Emp. Form.:
C26H24N8O6
Mol. Mass.:
544.5188
SMILES:
COc1cc2nc(nc(N)c2cc1OC)N1CCN(CC1)C(=O)c1cn(nn1)-c1cc2ccc(O)cc2oc1=O
: