Target
Alpha-1A adrenergic receptor
Ligand
BDBM50091349
Substrate
Meas. Tech.
ChEMBL_1497770 (CHEMBL3583290)
Ki
4.7±n/a nM
Citation
 Zhang, WMa, ZLi, WLi, GChen, LLiu, ZDu, LLi, M Discovery of Quinazoline-Based Fluorescent Probes toa1-Adrenergic Receptors. ACS Med Chem Lett 6:502-6 (2015)  
Target
Name:
Alpha-1A adrenergic receptor
Synonyms:
ADA1A_HUMAN ADRA1C Alpha 1A-adrenoceptor Alpha adrenergic receptor 1a Alpha-adrenergic receptor 1c adrenergic Alpha1 | adrenergic Alpha1C
Type:
Cell-surface receptors
Mol. Mass.:
51511.67
Organism:
Homo sapiens (Human)
Description:
P35348
Residue:
466
  
Inhibitor
Name:
BDBM50091349
Synonyms:
CHEMBL3582271
Type:
Small organic molecule
Emp. Form.:
C35H30N6O7S
Mol. Mass.:
678.714
SMILES:
COc1cc2nc(nc(N)c2cc1OC)N1CCN(CC1)C(=S)Nc1ccc(c(c1)C(O)=O)-c1c2ccc(O)cc2oc2cc(=O)ccc12
: