Target
Potassium voltage-gated channel subfamily H member 2
Ligand
BDBM50091555
Substrate
Meas. Tech.
ChEMBL_1498163 (CHEMBL3583383)
Ki
290±n/a nM
Citation
 Shah, SKHe, SGuo, LTruong, QQi, HDu, WLai, ZLiu, JJian, THong, QDobbelaar, PYe, ZSherer, EFeng, ZYu, YWong, FSamuel, KMadiera, MKaranam, BVReddy, VBMitelman, STong, SXChicchi, GGTsao, KLTrusca, DFeng, YWu, MShao, QTrujillo, MEEiermann, GJLi, CPachanski, MFernandez, GNelson, DBunting, PMorissette, PVolksdorf, SKerr, JZhang, BBHoward, ADZhou, YPPasternak, ANargund, RPHagmann, WK Discovery of MK-1421, a Potent, Selective sstr3 Antagonist, as a Development Candidate for Type 2 Diabetes. ACS Med Chem Lett 6:513-7 (2015)  
Target
Name:
Potassium voltage-gated channel subfamily H member 2
Synonyms:
1,3-beta-glucan synthase component GLS2 ERG Eag-related protein 1 Ether-a-go-go-related gene (HERG) Ether-a-go-go-related gene potassium channel 1 Ether-a-go-go-related gene potassium channel 1 (hERG1) Ether-a-go-go-related protein 1 H-ERG KCNH2 Potassium voltage-gated channel subfamily H member 2 (hERG) Voltage-gated potassium channel subunit Kv11.1 hERG Potassium Channel 1 | putative potassium channel subunit
Type:
Multi-pass membrane protein
Mol. Mass.:
126672.65
Organism:
Homo sapiens (Human)
Description:
Q12809
Residue:
1159
  
Inhibitor
Name:
BDBM50091555
Synonyms:
CHEMBL3582307
Type:
Small organic molecule
Emp. Form.:
C20H17FN4
Mol. Mass.:
332.3742
SMILES:
Fc1ccc(cc1)-c1c[nH]c(n1)[C@H]1Cc2c(CN1)[nH]c1ccccc21
: