Target
BDNF/NT-3 growth factors receptor
Ligand
BDBM50092085
Substrate
Meas. Tech.
ChEMBL_1498686 (CHEMBL3582855)
IC50
11±n/a nM
Citation
 Choi, HSRucker, PVWang, ZFan, YAlbaugh, PChopiuk, GGessier, FSun, FAdrian, FLiu, GHood, TLi, NJia, YChe, JMcCormack, SLi, ALi, JSteffy, ACulazzo, ATompkins, CPhung, VKreusch, ALu, MHu, BChaudhary, APrashad, MTuntland, TLiu, BHarris, JSeidel, HMLoren, JMolteni, V (R)-2-Phenylpyrrolidine Substituted Imidazopyridazines: A New Class of Potent and Selective Pan-TRK Inhibitors. ACS Med Chem Lett 6:562-7 (2015)  
Target
Name:
BDNF/NT-3 growth factors receptor
Synonyms:
GP145-TrkB NTRK2 Neurotrophic tyrosine kinase receptor type 2 Trk-B Tropomyosin-related kinase B Tyrosine kinase receptor B (Trk-B)
Type:
Enzyme
Mol. Mass.:
91996.87
Organism:
Homo sapiens (Human)
Description:
Q16620
Residue:
822
  
Inhibitor
Name:
BDBM50092085
Synonyms:
CHEMBL3582438
Type:
Small organic molecule
Emp. Form.:
C23H18FN5
Mol. Mass.:
383.4209
SMILES:
Fc1cccc(c1)[C@H]1CCCN1c1ccc2ncc(-c3ccc(cc3)C#N)n2n1
: