Target
Cytochrome P450 11B2, mitochondrial
Ligand
BDBM50092178
Substrate
Meas. Tech.
ChEMBL_1498857 (CHEMBL3583831)
IC50
254±n/a nM
Target
Name:
Cytochrome P450 11B2, mitochondrial
Synonyms:
Aldosterone Synthase (CYP11B2) Aldosterone-synthesizing enzyme CYP11B2 Cytochrome P450 11B2 Cytochrome P450 11B2, mitochondrial P-450C18 | Steroid 18-hydroxylase
Type:
Protein
Mol. Mass.:
57582.15
Organism:
Homo sapiens (Human)
Description:
P19099
Residue:
503
  
Inhibitor
Name:
BDBM50092178
Synonyms:
CHEMBL3582466
Type:
Small organic molecule
Emp. Form.:
C16H12F3N3
Mol. Mass.:
303.2818
SMILES:
FC(F)(F)c1ccc2nc(-c3cccnc3)n(C3CC3)c2c1
: