Target
Adenosine receptor A3
Ligand
BDBM50109461
Substrate
Meas. Tech.
ChEMBL_1499924 (CHEMBL3583616)
Ki
0.160000±n/a nM
Citation
 Baraldi, PGBaraldi, SSaponaro, GAghazadeh Tabrizi, MRomagnoli, RRuggiero, EVincenzi, FBorea, PAVarani, K One-pot reaction to obtain N,N'-disubstituted guanidines of pyrazolo[4,3-e][1,2,4]triazolo[1,5-c]pyrimidine scaffold as human A3 adenosine receptor antagonists. J Med Chem 58:5355-60 (2015)  
Target
Name:
Adenosine receptor A3
Synonyms:
A3 adenosine receptor (hA3) ADORA3 | Adenosine A3 receptor (A3AR)
Type:
G Protein-Coupled Receptor (GPCR)
Mol. Mass.:
36197.32
Organism:
Homo sapiens (Human)
Description:
P0DMS8
Residue:
318
  
Inhibitor
Name:
BDBM50109461
Synonyms:
1-(2-(furan-2-yl)-8-methyl-8H-pyrazolo[4,3-e][1,2,4]triazolo[1,5-c]pyrimidin-5-yl)-3-phenylurea CHEMBL324735 | MRE 3046F20
Type:
Small organic molecule
Emp. Form.:
C18H14N8O2
Mol. Mass.:
374.3562
SMILES:
Cn1cc2c(n1)nc(NC(=O)Nc1ccccc1)n1nc(nc21)-c1ccco1
: