Target
Bromodomain-containing protein 4
Ligand
BDBM50092311
Substrate
Meas. Tech.
ChEMBL_1498010 (CHEMBL3584939)
Ki
27±n/a nM
Citation
 Ran, XZhao, YLiu, LBai, LYang, CYZhou, BMeagher, JLChinnaswamy, KStuckey, JAWang, S Structure-Based Design of¿-Carboline Analogues as Potent and Specific BET Bromodomain Inhibitors. J Med Chem 58:4927-39 (2015)  
Target
Name:
Bromodomain-containing protein 4
Synonyms:
BRD4 Bromodomain-containing protein 4 (BRD4) Protein HUNK1
Type:
Protein
Mol. Mass.:
152264.84
Organism:
Homo sapiens (Human)
Description:
O60885
Residue:
1362
  
Inhibitor
Name:
BDBM50092311
Synonyms:
CHEMBL3581662
Type:
Small organic molecule
Emp. Form.:
C28H25N5O2
Mol. Mass.:
463.5304
SMILES:
CCc1[nH]nc(c1-c1nccc2[nH]c3cc(-c4c(C)noc4C)c(OC)cc3c12)-c1ccccc1
: