Target
Bromodomain-containing protein 3
Ligand
BDBM50365463
Substrate
Meas. Tech.
ChEMBL_1498186 (CHEMBL3583406)
Ki
30±n/a nM
Citation
 Ran, XZhao, YLiu, LBai, LYang, CYZhou, BMeagher, JLChinnaswamy, KStuckey, JAWang, S Structure-Based Design of¿-Carboline Analogues as Potent and Specific BET Bromodomain Inhibitors. J Med Chem 58:4927-39 (2015)  
Target
Name:
Bromodomain-containing protein 3
Synonyms:
BRD3 Bromodomain and extra-terminal motif (BET) Bromodomain-containing protein 3 (BRD3) RING3-like protein | RING3L
Type:
Protein
Mol. Mass.:
79571.81
Organism:
Homo sapiens (Human)
Description:
Q15059
Residue:
726
  
Inhibitor
Name:
BDBM50365463
Synonyms:
CHEMBL1232461
Type:
Small organic molecule
Emp. Form.:
C22H22ClN5O2
Mol. Mass.:
423.895
SMILES:
CCNC(=O)C[C@@H]1N=C(c2ccc(Cl)cc2)c2cc(OC)ccc2-n2c(C)nnc12
: