Target
Bromodomain-containing protein 2
Ligand
BDBM50380682
Substrate
Meas. Tech.
ChEMBL_1498013 (CHEMBL3585074)
Ki
50±n/a nM
Citation
 Ran, XZhao, YLiu, LBai, LYang, CYZhou, BMeagher, JLChinnaswamy, KStuckey, JAWang, S Structure-Based Design of¿-Carboline Analogues as Potent and Specific BET Bromodomain Inhibitors. J Med Chem 58:4927-39 (2015)  
Target
Name:
Bromodomain-containing protein 2
Synonyms:
BRD2 Bromodomain and extra-terminal motif (BET) Bromodomain-containing protein 2 (BRD2) RING3
Type:
Protein
Mol. Mass.:
88085.95
Organism:
Homo sapiens (Human)
Description:
P25440
Residue:
801
  
Inhibitor
Name:
BDBM50380682
Synonyms:
CHEMBL2017291 | I-BET151 (16)
Type:
Small organic molecule
Emp. Form.:
C23H21N5O3
Mol. Mass.:
415.4445
SMILES:
COc1cc2c3n([C@H](C)c4ccccn4)c(=O)[nH]c3cnc2cc1-c1c(C)noc1C
: