Target
Bromodomain-containing protein 2
Ligand
BDBM50092312
Substrate
Meas. Tech.
ChEMBL_1498013 (CHEMBL3585074)
Ki
5.4±n/a nM
Citation
 Ran, XZhao, YLiu, LBai, LYang, CYZhou, BMeagher, JLChinnaswamy, KStuckey, JAWang, S Structure-Based Design of¿-Carboline Analogues as Potent and Specific BET Bromodomain Inhibitors. J Med Chem 58:4927-39 (2015)  
Target
Name:
Bromodomain-containing protein 2
Synonyms:
BRD2 Bromodomain and extra-terminal motif (BET) Bromodomain-containing protein 2 (BRD2) RING3
Type:
Protein
Mol. Mass.:
88085.95
Organism:
Homo sapiens (Human)
Description:
P25440
Residue:
801
  
Inhibitor
Name:
BDBM50092312
Synonyms:
Birabresib OTX-015
Type:
Small organic molecule
Emp. Form.:
C25H22ClN5O2S
Mol. Mass.:
491.992
SMILES:
[H][C@@]1(CC(=O)Nc2ccc(O)cc2)N=C(c2c(C)c(C)sc2-n2c(C)nnc12)c1ccc(Cl)cc1
: