Target
Bromodomain-containing protein 4
Ligand
BDBM50092316
Substrate
Meas. Tech.
ChEMBL_1498011 (CHEMBL3584940)
Ki
134±n/a nM
Citation
 Ran, XZhao, YLiu, LBai, LYang, CYZhou, BMeagher, JLChinnaswamy, KStuckey, JAWang, S Structure-Based Design of¿-Carboline Analogues as Potent and Specific BET Bromodomain Inhibitors. J Med Chem 58:4927-39 (2015)  
Target
Name:
Bromodomain-containing protein 4
Synonyms:
BRD4 Bromodomain-containing protein 4 (BRD4) Protein HUNK1
Type:
Protein
Mol. Mass.:
152264.84
Organism:
Homo sapiens (Human)
Description:
O60885
Residue:
1362
  
Inhibitor
Name:
BDBM50092316
Synonyms:
CHEMBL3581658 | US9675697, Cpd. No. 24
Type:
Small organic molecule
Emp. Form.:
C23H23N5O2
Mol. Mass.:
401.461
SMILES:
COc1cc2c(cc1-c1c(C)noc1C)[nH]c1ccnc(-c3c(C)nn(C)c3C)c21
: