Target
Bromodomain-containing protein 4
Ligand
BDBM50092341
Substrate
Meas. Tech.
ChEMBL_1498010 (CHEMBL3584939)
Ki
44±n/a nM
Citation
 Ran, XZhao, YLiu, LBai, LYang, CYZhou, BMeagher, JLChinnaswamy, KStuckey, JAWang, S Structure-Based Design of¿-Carboline Analogues as Potent and Specific BET Bromodomain Inhibitors. J Med Chem 58:4927-39 (2015)  
Target
Name:
Bromodomain-containing protein 4
Synonyms:
BRD4 Bromodomain-containing protein 4 (BRD4) Protein HUNK1
Type:
Protein
Mol. Mass.:
152264.84
Organism:
Homo sapiens (Human)
Description:
O60885
Residue:
1362
  
Inhibitor
Name:
BDBM50092341
Synonyms:
CHEMBL3581660 | US9675697, Cpd. No. 22
Type:
Small organic molecule
Emp. Form.:
C24H25N5O2
Mol. Mass.:
415.4876
SMILES:
CCc1n[nH]c(CC)c1-c1nccc2[nH]c3cc(-c4c(C)noc4C)c(OC)cc3c12
: