Target
Protein arginine N-methyltransferase 1 [11-371]
Ligand
BDBM50095351
Substrate
Meas. Tech.
ChEMBL_1504110 (CHEMBL3591484)
IC50
13±n/a nM
Citation
 Mitchell, LHDrew, AERibich, SARioux, NSwinger, KKJacques, SLLingaraj, TBoriack-Sjodin, PAWaters, NJWigle, TJMoradei, OJin, LRiera, TPorter-Scott, MMoyer, MPSmith, JJChesworth, RCopeland, RA Aryl Pyrazoles as Potent Inhibitors of Arginine Methyltransferases: Identification of the First PRMT6 Tool Compound. ACS Med Chem Lett 6:655-9 (2015)  
Target
Name:
Protein arginine N-methyltransferase 1 [11-371]
Synonyms:
ANM1_HUMAN HRMT1L2 PRMT1 Protein arginine methyltransferase 1 (PRMT1) | Protein-arginine N-methyltransferase 1
Type:
Protein
Mol. Mass.:
41506.52
Organism:
Homo sapiens (Human)
Description:
Q99873[11-371]
Residue:
361
  
Inhibitor
Name:
BDBM50095351
Synonyms:
CHEMBL3589033
Type:
Small organic molecule
Emp. Form.:
C18H28N4O2
Mol. Mass.:
332.4405
SMILES:
CCC(CO)Oc1ccc(cc1)-c1[nH]ncc1CN(C)CCNC
: