Target
Lysine-specific demethylase 3A
Ligand
BDBM50095447
Substrate
Meas. Tech.
ChEMBL_1504146 (CHEMBL3591678)
IC50
>100000±n/a nM
Citation
 Itoh, YSawada, HSuzuki, MTojo, TSasaki, RHasegawa, MMizukami, TSuzuki, T Identification of Jumonji AT-Rich Interactive Domain 1A Inhibitors and Their Effect on Cancer Cells. ACS Med Chem Lett 6:665-70 (2015)  
Target
Name:
Lysine-specific demethylase 3A
Synonyms:
JHDM2A JMJD1A Jumonji domain-containing protein 1A KDM3A_HUMAN Lysine-specific demethylase 3A (KDM3A) | TSGA
Type:
PROTEIN
Mol. Mass.:
147368.22
Organism:
Homo sapiens (Human)
Description:
Q9Y4C1
Residue:
1321
  
Inhibitor
Name:
BDBM50095447
Synonyms:
CHEMBL3590427
Type:
Small organic molecule
Emp. Form.:
C15H30N2O4
Mol. Mass.:
302.4097
SMILES:
CCCCCCN(C)CCCCC(=O)N(O)CCC(O)=O
: