Target
N-lysine methyltransferase SMYD2
Ligand
BDBM50095537
Substrate
Meas. Tech.
ChEMBL_1504279 (CHEMBL3592282)
IC50
2.8±n/a nM
Citation
 Sweis, RFWang, ZAlgire, MArrowsmith, CHBrown, PJChiang, GGGuo, JJakob, CGKennedy, SLi, FMaag, DShaw, BSoni, NBVedadi, MPappano, WN Discovery of A-893, A New Cell-Active Benzoxazinone Inhibitor of Lysine Methyltransferase SMYD2. ACS Med Chem Lett 6:695-700 (2015)  
Target
Name:
N-lysine methyltransferase SMYD2
Synonyms:
HSKM-B KMT3C N-lysine methyltransferase SMYD2 SET and MYND domain-containing protein 2 (SMYD2) SMYD2_HUMAN
Type:
Enzyme
Mol. Mass.:
49689.57
Organism:
Homo sapiens (Human)
Description:
Q9NRG4
Residue:
433
  
Inhibitor
Name:
BDBM50095537
Synonyms:
CHEMBL3590526 | US9598381, 1a (S enantiomer)
Type:
Small organic molecule
Emp. Form.:
C29H38Cl2N4O4
Mol. Mass.:
577.542
SMILES:
O[C@@H](CNCCN(C1CCCCC1)C(=O)CCNCCc1ccc(Cl)c(Cl)c1)c1cccc2NC(=O)COc12
: