Target
Bone morphogenetic protein receptor type-1A
Ligand
BDBM50095952
Substrate
Meas. Tech.
ChEMBL_1505335 (CHEMBL3595103)
IC50
>1000±n/a nM
Citation
 Nakajima, YInoue, TNakai, KMukoyoshi, KHamaguchi, HHatanaka, KSasaki, HTanaka, ATakahashi, FKunikawa, SUsuda, HMoritomo, AHigashi, YInami, MShirakami, S Synthesis and evaluation of novel 1H-pyrrolo[2,3-b]pyridine-5-carboxamide derivatives as potent and orally efficacious immunomodulators targeting JAK3. Bioorg Med Chem 23:4871-83 (2015)  
Target
Name:
Bone morphogenetic protein receptor type-1A
Synonyms:
ACVRLK3 Activin receptor-like kinase 3 (ALK-3) BMR1A_HUMAN
Type:
Enzyme
Mol. Mass.:
60204.46
Organism:
Homo sapiens (Human)
Description:
P36894
Residue:
532
  
Inhibitor
Name:
BDBM50095952
Synonyms:
CHEMBL3593777
Type:
Small organic molecule
Emp. Form.:
C19H18FN7O
Mol. Mass.:
379.3909
SMILES:
NC(=O)c1cnc2[nH]ccc2c1N[C@@H]1CCN(C[C@@H]1F)c1ccc(cn1)C#N
: