Target
5-hydroxytryptamine receptor 1A
Ligand
BDBM50033852
Substrate
Meas. Tech.
ChEMBL_1505669 (CHEMBL3594589)
Ki
0.480000±n/a nM
Citation
 Stroth, NNiso, MColabufo, NAPerrone, RSvenningsson, PLacivita, ELeopoldo, M Arylpiperazine agonists of the serotonin 5-HT1A receptor preferentially activate cAMP signaling versus recruitment of฿-arrestin-2. Bioorg Med Chem 23:4824-30 (2015)  
Target
Name:
5-hydroxytryptamine receptor 1A
Synonyms:
5-HT-1A 5-hydroxytryptamine receptor 1A (5-HT-1A) ADRB2RL1 Dopamine D2 receptor and serotonin 1a receptor HTR1A | Serotonin receptor 1A
Type:
Mol. Mass.:
46122.49
Organism:
Homo sapiens (Human)
Description:
Residue:
422
  
Inhibitor
Name:
BDBM50033852
Synonyms:
1-[3-(5-Methoxy-1,2,3,4-tetrahydro-naphthalen-1-yl)-propyl]-4-pyridin-2-yl-piperazine | CHEMBL444590
Type:
Small organic molecule
Emp. Form.:
C23H31N3O
Mol. Mass.:
365.5117
SMILES:
COc1cccc2C(CCCN3CCN(CC3)c3ccccn3)CCCc12
: