Target
Low molecular weight phosphotyrosine protein phosphatase
Ligand
BDBM50096253
Substrate
Meas. Tech.
ChEMBL_1506094 (CHEMBL3595960)
Ki
124000±n/a nM
Citation
 Fonseca, EMTrivella, DBScorsato, VDias, MPBazzo, NLMandapati, KRde Oliveira, FLFerreira-Halder, CVPilli, RAMiranda, PCAparicio, R Crystal structures of the apo form and a complex of human LMW-PTP with a phosphonic acid provide new evidence of a secondary site potentially related to the anchorage of natural substrates. Bioorg Med Chem 23:4462-71 (2015)  
Target
Name:
Low molecular weight phosphotyrosine protein phosphatase
Synonyms:
Acp1 LMW-PTPase Low molecular weight phosphotyrosine protein phosphatase | PPAC_MOUSE
Type:
PROTEIN
Mol. Mass.:
18192.04
Organism:
Mus musculus
Description:
ChEMBL_109834
Residue:
158
  
Inhibitor
Name:
BDBM50096253
Synonyms:
CHEMBL3593255
Type:
Small organic molecule
Emp. Form.:
C7H8NO5P
Mol. Mass.:
217.1159
SMILES:
OP(O)(=O)Cc1ccc(cc1)[N+]([O-])=O
: