Target
RAF proto-oncogene serine/threonine-protein kinase
Ligand
BDBM50096324
Substrate
Meas. Tech.
ChEMBL_1495599 (CHEMBL3578337)
IC50
5.6±n/a nM
Citation
 Henry, JRKaufman, MDPeng, SBAhn, YMCaldwell, TMVogeti, LTelikepalli, HLu, WPHood, MMRutkoski, TJSmith, BDVogeti, SMiller, DWise, SCChun, LZhang, XZhang, YKays, LHipskind, PAWrobleski, ADLobb, KLClay, JMCohen, JDWalgren, JLMcCann, DPatel, PClawson, DKGuo, SManglicmot, DGroshong, CLogan, CStarling, JJFlynn, DL Discovery of 1-(3,3-dimethylbutyl)-3-(2-fluoro-4-methyl-5-(7-methyl-2-(methylamino)pyrido[2,3-d]pyrimidin-6-yl)phenyl)urea (LY3009120) as a pan-RAF inhibitor with minimal paradoxical activation and activity against BRAF or RAS mutant tumor cells. J Med Chem 58:4165-79 (2015)  
Target
Name:
RAF proto-oncogene serine/threonine-protein kinase
Synonyms:
C-Raf Protein Kinase RAF RAF1 Raf-1 Serine/threonine-protein kinase C-Raf | cRaf
Type:
Serine/threonine-protein kinase
Mol. Mass.:
73082.52
Organism:
Homo sapiens (Human)
Description:
P04049
Residue:
648
  
Inhibitor
Name:
BDBM50096324
Synonyms:
CHEMBL3577121
Type:
Small organic molecule
Emp. Form.:
C24H30FN5O
Mol. Mass.:
423.5263
SMILES:
CNc1cc2nc(C)c(cc2cn1)-c1cc(NC(=O)NCCC(C)(C)C)c(F)cc1C
: