Target
Beta sliding clamp
Ligand
BDBM50096604
Substrate
Meas. Tech.
ChEMBL_1495912 (CHEMBL3579723)
IC50
27000±n/a nM
Citation
 Yin, ZWhittell, LRWang, YJergic, SMa, CLewis, PJDixon, NEBeck, JLKelso, MJOakley, AJ Bacterial Sliding Clamp Inhibitors that Mimic the Sequential Binding Mechanism of Endogenous Linear Motifs. J Med Chem 58:4693-702 (2015)  
Target
Name:
Beta sliding clamp
Synonyms:
Beta clamp DNA polymerase III subunit beta JW3678 | dnaN
Type:
PROTEIN
Mol. Mass.:
40578.60
Organism:
Escherichia coli (strain K12)
Description:
ChEMBL_109765
Residue:
366
  
Inhibitor
Name:
BDBM50096604
Synonyms:
CHEMBL3577290
Type:
Small organic molecule
Emp. Form.:
C24H23BrN2O5
Mol. Mass.:
499.354
SMILES:
OC(=O)[C@H](Cc1ccccc1)NC(=O)Cn1c2C[C@@H](CCc2c2cc(Br)ccc12)C(O)=O
: