Target
cAMP-dependent protein kinase catalytic subunit alpha
Ligand
BDBM50097171
Substrate
Meas. Tech.
ChEMBL_1499749 (CHEMBL3585198)
Ki
2400±n/a nM
Citation
 Green, JCao, JBandarage, UKGao, HCourt, JMarhefka, CJacobs, MTaslimi, PNewsome, DNakayama, TShah, SRodems, S Design, Synthesis, and Structure-Activity Relationships of Pyridine-Based Rho Kinase (ROCK) Inhibitors. J Med Chem 58:5028-37 (2015)  
Target
Name:
cAMP-dependent protein kinase catalytic subunit alpha
Synonyms:
KAPCA_HUMAN PKACA cAMP-dependent protein kinase (PKA) cAMP-dependent protein kinase catalytic subunit alpha cAMP-dependent protein kinase catalytic subunit alpha (PKACA) cAMP-dependent protein kinase catalytic subunit alpha isoform 1 | cAMP-dependent protein kinase, alpha-catalytic subunit
Type:
Enzyme Catalytic Subunit
Mol. Mass.:
40598.73
Organism:
Homo sapiens (Human)
Description:
Residue:
351
  
Inhibitor
Name:
BDBM50097171
Synonyms:
CHEMBL3581133
Type:
Small organic molecule
Emp. Form.:
C18H16N2O2S
Mol. Mass.:
324.397
SMILES:
COc1cccc(CC(=O)Nc2csc(c2)-c2ccncc2)c1
: