Target
Tyrosine-protein kinase BTK
Ligand
BDBM50097393
Substrate
Meas. Tech.
ChEMBL_1501913 (CHEMBL3588253)
IC50
4000±n/a nM
Citation
 Smith, CRDougan, DRKomandla, MKanouni, TKnight, BLawson, JDSabat, MTaylor, ERVu, PWyrick, C Fragment-Based Discovery of a Small Molecule Inhibitor of Bruton's Tyrosine Kinase. J Med Chem 58:5437-44 (2015)  
Target
Name:
Tyrosine-protein kinase BTK
Synonyms:
AGMX1 Agammaglobulinaemia tyrosine kinase B cell progenitor kinase BPK BTK_HUMAN Tyrosine Kinase BTK Tyrosine-protein kinase BTK (BTK)
Type:
Enzyme
Mol. Mass.:
76289.95
Organism:
Homo sapiens (Human)
Description:
Q06187
Residue:
659
  
Inhibitor
Name:
BDBM50097393
Synonyms:
CHEMBL3586447
Type:
Small organic molecule
Emp. Form.:
C17H14N6O
Mol. Mass.:
318.3327
SMILES:
Cc1cc2cn[nH]c2cc1-c1cccc2c(N)c(nnc12)C(N)=O
: