Target
Tyrosine-protein kinase BTK
Ligand
BDBM50097395
Substrate
Meas. Tech.
ChEMBL_1501913 (CHEMBL3588253)
IC50
850000±n/a nM
Citation
 Smith, CRDougan, DRKomandla, MKanouni, TKnight, BLawson, JDSabat, MTaylor, ERVu, PWyrick, C Fragment-Based Discovery of a Small Molecule Inhibitor of Bruton's Tyrosine Kinase. J Med Chem 58:5437-44 (2015)  
Target
Name:
Tyrosine-protein kinase BTK
Synonyms:
AGMX1 Agammaglobulinaemia tyrosine kinase B cell progenitor kinase BPK BTK_HUMAN Tyrosine Kinase BTK Tyrosine-protein kinase BTK (BTK)
Type:
Enzyme
Mol. Mass.:
76289.95
Organism:
Homo sapiens (Human)
Description:
Q06187
Residue:
659
  
Inhibitor
Name:
BDBM50097395
Synonyms:
CHEMBL3586445
Type:
Small organic molecule
Emp. Form.:
C17H13N5O
Mol. Mass.:
303.318
SMILES:
NC(=O)c1nnc2c(cccc2c1N)-c1ccc2cc[nH]c2c1
: